Information card for entry 4303985
Formula | C89.5 H70 Cl3 Hf2 N8 O18 P3 |
Calculated formula | C89.5 H57 Cl3 Hf2 N8 O18 P3 |
Title of publication | Routes to New Hafnium(IV) Tetraaryl Porphyrins and Crystal Structures of Unusual Phosphate-, Sulfate-, and Peroxide-Bridged Dimers |
Authors of publication | Alexander Falber; Louis Todaro; Israel Goldberg; Michael V. Favilla; Charles Michael Drain |
Journal of publication | Inorganic Chemistry |
Year of publication | 2008 |
Journal volume | 47 |
Pages of publication | 454 - 467 |
a | 21.067 ± 0.004 Å |
b | 15.382 ± 0.003 Å |
c | 55.378 ± 0.011 Å |
α | 90° |
β | 91.6 ± 0.03° |
γ | 90° |
Cell volume | 17938 ± 6 Å3 |
Cell temperature | 100 ± 2 K |
Ambient diffraction temperature | 100 ± 2 K |
Number of distinct elements | 7 |
Space group number | 15 |
Hermann-Mauguin space group symbol | C 1 2/c 1 |
Hall space group symbol | -C 2yc |
Residual factor for all reflections | 0.1912 |
Residual factor for significantly intense reflections | 0.0974 |
Weighted residual factors for significantly intense reflections | 0.1743 |
Weighted residual factors for all reflections included in the refinement | 0.2058 |
Goodness-of-fit parameter for all reflections included in the refinement | 1.085 |
Diffraction radiation wavelength | 0.71073 Å |
Diffraction radiation type | MoKα |