Information card for entry 4303992
Formula | C28 H44 Ge O10 P2 Si4 W2 |
Calculated formula | C28 H44 Ge O10 P2 Si4 W2 |
SMILES | [W]([P]1[Ge](C(=[P](C=1C)[W](C#[O])(C#[O])(C#[O])(C#[O])C#[O])C)(C([Si](C)(C)C)[Si](C)(C)C)C([Si](C)(C)C)[Si](C)(C)C)(C#[O])(C#[O])(C#[O])(C#[O])C#[O] |
Title of publication | Unusual Reactivity of Methylphosphaalkyne (P\τbCMe) toward Digermenes and Distannenes: Stepwise Formations of Bridged 2,3,5,6-Tetraphospha-1,4-dimethylidenecyclohexanes |
Authors of publication | Cameron Jones; Christian Schulten; Andreas Stasch |
Journal of publication | Inorganic Chemistry |
Year of publication | 2008 |
Journal volume | 47 |
Pages of publication | 1273 - 1278 |
a | 11.323 ± 0.002 Å |
b | 18.487 ± 0.004 Å |
c | 20.297 ± 0.004 Å |
α | 90° |
β | 90° |
γ | 90° |
Cell volume | 4248.7 ± 1.5 Å3 |
Cell temperature | 150 ± 2 K |
Ambient diffraction temperature | 150 ± 2 K |
Number of distinct elements | 7 |
Space group number | 19 |
Hermann-Mauguin space group symbol | P 21 21 21 |
Hall space group symbol | P 2ac 2ab |
Residual factor for all reflections | 0.0264 |
Residual factor for significantly intense reflections | 0.0246 |
Weighted residual factors for significantly intense reflections | 0.0533 |
Weighted residual factors for all reflections included in the refinement | 0.0538 |
Goodness-of-fit parameter for all reflections included in the refinement | 1.048 |
Diffraction radiation wavelength | 0.71073 Å |
Diffraction radiation type | MoKα |