Information card for entry 4304072
Common name | lanthanum manganese bismuthide (3/1/5) |
Chemical name | trilanthanum manganese pentabismuthide |
Formula | Bi5 La3 Mn |
Calculated formula | Bi5 La3 Mn |
Title of publication | Ternary Rare-Earth Manganese Bismuthides: Structures and Physical Properties of RE3MnBi5 (RE = La-Nd) and Sm2Mn3Bi6 |
Authors of publication | Oksana Ya. Zelinska; Arthur Mar |
Journal of publication | Inorganic Chemistry |
Year of publication | 2008 |
Journal volume | 47 |
Pages of publication | 297 - 305 |
a | 9.7139 ± 0.0011 Å |
b | 9.7139 ± 0.0011 Å |
c | 6.4883 ± 0.0007 Å |
α | 90° |
β | 90° |
γ | 120° |
Cell volume | 530.21 ± 0.1 Å3 |
Cell temperature | 193 ± 2 K |
Ambient diffraction temperature | 193 ± 2 K |
Number of distinct elements | 3 |
Space group number | 193 |
Hermann-Mauguin space group symbol | P 63/m c m |
Hall space group symbol | -P 6c 2 |
Residual factor for all reflections | 0.0285 |
Residual factor for significantly intense reflections | 0.0219 |
Weighted residual factors for significantly intense reflections | 0.0474 |
Weighted residual factors for all reflections included in the refinement | 0.0488 |
Goodness-of-fit parameter for all reflections included in the refinement | 1.183 |
Diffraction radiation wavelength | 0.71073 Å |
Diffraction radiation type | MoKα |