Information card for entry 4304086
Formula | C12 H10 Br1.96 Cl2.04 Cu N2 |
Calculated formula | C12 H10 Br1.966 Cl2.034 Cu N2 |
Title of publication | Halogen Exchange and Scrambling between C-X and M-X' Bonds in Copper, Nickel, and Cobalt Complexes of 6,6'-bis(bromo/ chloromethyl)-2,2'-bipyridine. Structural, Electrochemical, and Photochemical Studies |
Authors of publication | Meenakshi Ghosh; Papu Biswas; Ulrich Flörke; Kamalaksha Nag |
Journal of publication | Inorganic Chemistry |
Year of publication | 2008 |
Journal volume | 47 |
Pages of publication | 281 - 296 |
a | 7.4752 ± 0.0007 Å |
b | 15.6725 ± 0.0013 Å |
c | 12.6372 ± 0.0011 Å |
α | 90° |
β | 103.837 ± 0.002° |
γ | 90° |
Cell volume | 1437.5 ± 0.2 Å3 |
Cell temperature | 150 ± 2 K |
Ambient diffraction temperature | 150 ± 2 K |
Number of distinct elements | 6 |
Space group number | 14 |
Hermann-Mauguin space group symbol | P 1 21/c 1 |
Hall space group symbol | -P 2ybc |
Residual factor for all reflections | 0.1094 |
Residual factor for significantly intense reflections | 0.0485 |
Weighted residual factors for significantly intense reflections | 0.0649 |
Weighted residual factors for all reflections included in the refinement | 0.0764 |
Goodness-of-fit parameter for all reflections included in the refinement | 0.978 |
Diffraction radiation wavelength | 0.71073 Å |
Diffraction radiation type | MoKα |