Information card for entry 4304092
Formula | C44 H60 Cl4 N4 O2 Pd2 Si4 |
Calculated formula | C44 H48 Cl4 N4 O2 Pd2 Si4 |
Title of publication | Subtle Ring-Constraint Effects on the Formation of Metallacycles. Cyclodimer versus Cyclotrimer of Bis(chloro)-1,4-bis(dimethyl-3 or 4-pyridylsilyl)benzenepalladium(II) Complexes |
Authors of publication | Young Mee Na; Tae Hwan Noh; In Sung Chun; Young-A Lee; Jongki Hong; Ok-Sang Jung |
Journal of publication | Inorganic Chemistry |
Year of publication | 2008 |
Journal volume | 47 |
Pages of publication | 1391 - 1396 |
a | 8.4631 ± 0.0005 Å |
b | 12.221 ± 0.0008 Å |
c | 13.8289 ± 0.0009 Å |
α | 83.164 ± 0.001° |
β | 72.731 ± 0.001° |
γ | 82.33 ± 0.001° |
Cell volume | 1348.82 ± 0.15 Å3 |
Cell temperature | 173 ± 2 K |
Ambient diffraction temperature | 173 ± 2 K |
Number of distinct elements | 7 |
Space group number | 2 |
Hermann-Mauguin space group symbol | P -1 |
Hall space group symbol | -P 1 |
Residual factor for all reflections | 0.0782 |
Residual factor for significantly intense reflections | 0.0472 |
Weighted residual factors for significantly intense reflections | 0.122 |
Weighted residual factors for all reflections included in the refinement | 0.1354 |
Goodness-of-fit parameter for all reflections included in the refinement | 1.053 |
Diffraction radiation wavelength | 0.71073 Å |
Diffraction radiation type | MoKα |