Information card for entry 4304193
Formula | H140 Mn Mo36 N22 O172 Sb12 |
Calculated formula | Mn Mo36 O191 Sb12 |
Title of publication | An Unusual Asymmetric Polyoxomolybdate Containing Mixed-Valence Antimony and Its Derivatives: [Sb4VSb2IIIMo18O73(H2O)2]12- and {M(H2O)2[Sb4VSb2IIIMo18O73(H2O)2]2}22- (M = MnII, FeII, CuII or CoII) |
Authors of publication | Ganglin Xue; Xuemei Liu; Haisheng Xu; Huaiming Hu; Feng Fu; Jiwu Wang |
Journal of publication | Inorganic Chemistry |
Year of publication | 2008 |
Journal volume | 47 |
Pages of publication | 2011 - 2016 |
a | 13.8612 ± 0.0009 Å |
b | 17.9531 ± 0.0012 Å |
c | 19.8574 ± 0.0014 Å |
α | 69.801 ± 0.001° |
β | 82.729 ± 0.001° |
γ | 69.345 ± 0.001° |
Cell volume | 4339.5 ± 0.5 Å3 |
Cell temperature | 293 ± 2 K |
Ambient diffraction temperature | 293 ± 2 K |
Number of distinct elements | 6 |
Space group number | 2 |
Hermann-Mauguin space group symbol | P -1 |
Hall space group symbol | -P 1 |
Residual factor for all reflections | 0.0489 |
Residual factor for significantly intense reflections | 0.0414 |
Weighted residual factors for significantly intense reflections | 0.1264 |
Weighted residual factors for all reflections included in the refinement | 0.131 |
Goodness-of-fit parameter for all reflections included in the refinement | 1.047 |
Diffraction radiation wavelength | 0.71073 Å |
Diffraction radiation type | MoKα |