Information card for entry 4304209
Formula | C39 H53 N2 O P Si2 Sn |
Calculated formula | C39 H53 N2 O P Si2 Sn |
SMILES | [Sn]1(Oc2c(cc(cc2C=[N]1c1ccccc1P(c1ccccc1)c1ccccc1)C(C)(C)C)C(C)(C)C)N([Si](C)(C)C)[Si](C)(C)C |
Title of publication | The Reversible Amination of Tin(II)-Ligated Imines: Latent Initiators for the Polymerization of rac-Lactide |
Authors of publication | Nonsee Nimitsiriwat; Vernon C. Gibson; Edward L. Marshall; Mark R. J. Elsegood |
Journal of publication | Inorganic Chemistry |
Year of publication | 2008 |
Journal volume | 47 |
Pages of publication | 5417 - 5424 |
a | 17.4654 ± 0.0016 Å |
b | 25.49 ± 0.002 Å |
c | 18.2675 ± 0.0017 Å |
α | 90° |
β | 91.521 ± 0.002° |
γ | 90° |
Cell volume | 8129.7 ± 1.2 Å3 |
Cell temperature | 150 ± 2 K |
Ambient diffraction temperature | 150 ± 2 K |
Number of distinct elements | 7 |
Space group number | 14 |
Hermann-Mauguin space group symbol | P 1 21/n 1 |
Hall space group symbol | -P 2yn |
Residual factor for all reflections | 0.1426 |
Residual factor for significantly intense reflections | 0.0709 |
Weighted residual factors for significantly intense reflections | 0.1796 |
Weighted residual factors for all reflections included in the refinement | 0.2284 |
Goodness-of-fit parameter for all reflections included in the refinement | 1.018 |
Diffraction radiation wavelength | 0.71073 Å |
Diffraction radiation type | MoKα |