Information card for entry 4304957
Formula | C45.5 H25 Cl F11 N9 O Ru2 S |
Calculated formula | C45.5 H25 Cl F11 N9 O Ru2 S |
Title of publication | Synthesis and Characterization of (3,1) Ru2(F3ap)4(NCS) and (3,1) Ru2(F3ap)3(F2Oap)(NCS) Where F3ap Is the 2-(2,4,6-Trifluoroanilino)pyridinate Anion |
Authors of publication | Minh Nguyen; Tuan Phan; Eric Van Caemelbecke; Xin Wei; John L. Bear; Karl M. Kadish |
Journal of publication | Inorganic Chemistry |
Year of publication | 2008 |
Journal volume | 47 |
Pages of publication | 4392 - 4400 |
a | 18.831 ± 0.003 Å |
b | 11.499 ± 0.002 Å |
c | 41.656 ± 0.006 Å |
α | 90° |
β | 101.234 ± 0.003° |
γ | 90° |
Cell volume | 8847 ± 2 Å3 |
Cell temperature | 223 ± 2 K |
Ambient diffraction temperature | 223 ± 2 K |
Number of distinct elements | 8 |
Space group number | 15 |
Hermann-Mauguin space group symbol | C 1 2/c 1 |
Hall space group symbol | -C 2yc |
Residual factor for all reflections | 0.0667 |
Residual factor for significantly intense reflections | 0.0522 |
Weighted residual factors for significantly intense reflections | 0.1272 |
Weighted residual factors for all reflections included in the refinement | 0.1395 |
Goodness-of-fit parameter for all reflections included in the refinement | 1.166 |
Diffraction radiation wavelength | 0.71073 Å |
Diffraction radiation type | MoKα |