Information card for entry 4305973
Formula | C46 H117 Mn8 N16 O50.5 |
Calculated formula | C46 H80 Mn8 N16 O50.5 |
Title of publication | Decomposition of Dinuclear Manganese Complexes for the Preparation of Nanostructured Oxide Materials |
Authors of publication | Jonathan P. Hill; Humberto Palza; Sher Alam; Katsuhiko Ariga; Amy Lea Schumacher; Francis D'Souza; Christopher E. Anson; Annie K. Powell |
Journal of publication | Inorganic Chemistry |
Year of publication | 2008 |
Journal volume | 47 |
Pages of publication | 8306 - 8314 |
a | 9.5442 ± 0.0011 Å |
b | 10.3758 ± 0.001 Å |
c | 21.851 ± 0.002 Å |
α | 83.72 ± 0.012° |
β | 80.106 ± 0.013° |
γ | 85.457 ± 0.013° |
Cell volume | 2114.9 ± 0.4 Å3 |
Cell temperature | 200 ± 2 K |
Ambient diffraction temperature | 200 ± 2 K |
Number of distinct elements | 5 |
Space group number | 2 |
Hermann-Mauguin space group symbol | P -1 |
Hall space group symbol | -P 1 |
Residual factor for all reflections | 0.1036 |
Residual factor for significantly intense reflections | 0.0498 |
Weighted residual factors for significantly intense reflections | 0.0981 |
Weighted residual factors for all reflections included in the refinement | 0.1049 |
Goodness-of-fit parameter for all reflections included in the refinement | 0.967 |
Diffraction radiation wavelength | 0.71073 Å |
Diffraction radiation type | MoKα |