Information card for entry 4306353
Formula | C26 H32 B10 Fe2 S2 |
Calculated formula | C26 H32 B10 Fe2 S2 |
SMILES | [BH]1234[BH]567[BH]89%10[BH]%11%12%13[BH]%14%159[BH]968[BH]615[BH]152[BH]%11%14([BH]%15961)[C]4%135([C]37%10%12SC(=C)[c]12[cH]3[cH]4[cH]5[cH]1[Fe]16782345[cH]2[cH]1[cH]6[cH]7[cH]82)SC(=C)[c]12[cH]3[cH]4[cH]5[cH]1[Fe]16782345[cH]2[cH]8[cH]7[cH]6[cH]12 |
Title of publication | Cobalt(III)-Mediated Disulfuration and Hydrosulfuration of Alkynes |
Authors of publication | Bao-Hua Xu; Xu-Qing Peng; Zhi-Wei Xu; Yi-Zhi Li; Hong Yan |
Journal of publication | Inorganic Chemistry |
Year of publication | 2008 |
Journal volume | 47 |
Pages of publication | 7928 - 7933 |
a | 10.2696 ± 0.0012 Å |
b | 10.668 ± 0.003 Å |
c | 14.0596 ± 0.0017 Å |
α | 74.06 ± 0.002° |
β | 88.13 ± 0.001° |
γ | 82.311 ± 0.003° |
Cell volume | 1467.8 ± 0.5 Å3 |
Cell temperature | 291 ± 2 K |
Ambient diffraction temperature | 291 ± 2 K |
Number of distinct elements | 5 |
Space group number | 2 |
Hermann-Mauguin space group symbol | P -1 |
Hall space group symbol | -P 1 |
Residual factor for all reflections | 0.0842 |
Residual factor for significantly intense reflections | 0.0612 |
Weighted residual factors for significantly intense reflections | 0.1256 |
Weighted residual factors for all reflections included in the refinement | 0.1303 |
Goodness-of-fit parameter for all reflections included in the refinement | 1.048 |
Diffraction radiation wavelength | 0.71073 Å |
Diffraction radiation type | MoKα |