Information card for entry 4306355
Formula | C10 H20 B10 O4 S2 |
Calculated formula | C10 H20 B10 O4 S2 |
SMILES | [BH]1234[BH]567[BH]89%10[BH]%11%12%13[BH]%14%159[BH]968[BH]615[BH]152[BH]%11%14([BH]%15961)[C]4%135([C]37%10%12S/C=C\C(=O)OC)S/C=C/C(=O)OC |
Title of publication | Cobalt(III)-Mediated Disulfuration and Hydrosulfuration of Alkynes |
Authors of publication | Bao-Hua Xu; Xu-Qing Peng; Zhi-Wei Xu; Yi-Zhi Li; Hong Yan |
Journal of publication | Inorganic Chemistry |
Year of publication | 2008 |
Journal volume | 47 |
Pages of publication | 7928 - 7933 |
a | 10.9663 ± 0.001 Å |
b | 12.7759 ± 0.0012 Å |
c | 14.7343 ± 0.0014 Å |
α | 83.959 ± 0.001° |
β | 76.678 ± 0.001° |
γ | 83.33 ± 0.001° |
Cell volume | 1988.6 ± 0.3 Å3 |
Cell temperature | 153 ± 2 K |
Ambient diffraction temperature | 153 ± 2 K |
Number of distinct elements | 5 |
Space group number | 2 |
Hermann-Mauguin space group symbol | P -1 |
Hall space group symbol | -P 1 |
Residual factor for all reflections | 0.0725 |
Residual factor for significantly intense reflections | 0.0478 |
Weighted residual factors for significantly intense reflections | 0.1156 |
Weighted residual factors for all reflections included in the refinement | 0.1257 |
Goodness-of-fit parameter for all reflections included in the refinement | 0.925 |
Diffraction radiation wavelength | 0.71073 Å |
Diffraction radiation type | MoKα |