Information card for entry 4306360
Formula | C55.45 H58.05 Fe2 Mn N6.65 O13 |
Calculated formula | C56.8 H45 Fe2 Mn N7.3 O13 |
Title of publication | Mechanism of Pyridine-Ligand Exchanges at the Different Labile Sites of 3d Heterometallic and Mixed Valence μ3-oxo Trinuclear Clusters |
Authors of publication | Ghenadie Novitchi; Fabrice Riblet; Rosario Scopelliti; Lothar Helm; Aurelian Gulea; André E. Merbach |
Journal of publication | Inorganic Chemistry |
Year of publication | 2008 |
Journal volume | 47 |
Pages of publication | 10587 - 10599 |
a | 20.31 ± 0.005 Å |
b | 26.33 ± 0.005 Å |
c | 11.114 ± 0.003 Å |
α | 90° |
β | 98.85 ± 0.03° |
γ | 90° |
Cell volume | 5873 ± 2 Å3 |
Cell temperature | 140 ± 2 K |
Ambient diffraction temperature | 140 ± 2 K |
Number of distinct elements | 6 |
Space group number | 12 |
Hermann-Mauguin space group symbol | C 1 2/m 1 |
Hall space group symbol | -C 2y |
Residual factor for all reflections | 0.1457 |
Residual factor for significantly intense reflections | 0.0839 |
Weighted residual factors for significantly intense reflections | 0.2072 |
Weighted residual factors for all reflections included in the refinement | 0.2452 |
Goodness-of-fit parameter for all reflections included in the refinement | 0.928 |
Diffraction radiation wavelength | 0.7107 Å |
Diffraction radiation type | MoKα |