Information card for entry 4306403
Formula | C15 H29 Cl Cu N4 O6 S2 |
Calculated formula | C15 H29 Cl Cu N4 O6 S2 |
SMILES | [Cu]123(SS(=O)(=O)c4ccccc4)[N](CC[NH]2C)(CC[NH]3C)CC[NH]1C.Cl(=O)(=O)(=O)[O-] |
Title of publication | Stabilization of Copper(II) Thiosulfonate Coordination Complexes Through Cooperative Hydrogen Bonding Interactions |
Authors of publication | Adam J. Fischmann; Craig M. Forsyth; Leone Spiccia |
Journal of publication | Inorganic Chemistry |
Year of publication | 2008 |
Journal volume | 47 |
Pages of publication | 10565 - 10574 |
a | 7.9481 ± 0.0005 Å |
b | 21.5982 ± 0.0013 Å |
c | 12.8819 ± 0.0008 Å |
α | 90° |
β | 106.872 ± 0.003° |
γ | 90° |
Cell volume | 2116.2 ± 0.2 Å3 |
Cell temperature | 123 ± 2 K |
Ambient diffraction temperature | 123 ± 2 K |
Number of distinct elements | 7 |
Space group number | 14 |
Hermann-Mauguin space group symbol | P 1 21/n 1 |
Hall space group symbol | -P 2yn |
Residual factor for all reflections | 0.0531 |
Residual factor for significantly intense reflections | 0.0494 |
Weighted residual factors for significantly intense reflections | 0.0894 |
Weighted residual factors for all reflections included in the refinement | 0.0908 |
Goodness-of-fit parameter for all reflections included in the refinement | 1.313 |
Diffraction radiation wavelength | 0.71073 Å |
Diffraction radiation type | MoKα |