Information card for entry 4306420
Common name | [AQ-NHC(OH)norbornene](ClO4) |
Formula | C30 H34 Cl N O11 |
Calculated formula | C30 H34 Cl N O11 |
Title of publication | Large Amplitude, Proton- and Cation-Activated Latch-Type Mechanical Switches: O-Protonated Amides Stabilized by Intramolecular, Low-Barrier Hydrogen Bonds within Macrocycles |
Authors of publication | Mariappan Kadarkaraisamy; Gerald Caple; Andrea R. Gorden; Marie A. Squire; Andrew G. Sykes |
Journal of publication | Inorganic Chemistry |
Year of publication | 2008 |
Journal volume | 47 |
Pages of publication | 11644 - 11655 |
a | 10.1692 ± 0.0013 Å |
b | 23.382 ± 0.003 Å |
c | 12.6558 ± 0.0016 Å |
α | 90° |
β | 109.543 ± 0.002° |
γ | 90° |
Cell volume | 2835.9 ± 0.6 Å3 |
Cell temperature | 100 ± 2 K |
Ambient diffraction temperature | 100 ± 2 K |
Number of distinct elements | 5 |
Space group number | 14 |
Hermann-Mauguin space group symbol | P 1 21/c 1 |
Hall space group symbol | -P 2ybc |
Residual factor for all reflections | 0.0823 |
Residual factor for significantly intense reflections | 0.0526 |
Weighted residual factors for significantly intense reflections | 0.1082 |
Weighted residual factors for all reflections included in the refinement | 0.1219 |
Goodness-of-fit parameter for all reflections included in the refinement | 1.036 |
Diffraction radiation wavelength | 0.71073 Å |
Diffraction radiation type | MoKα |