Information card for entry 4306444
Formula | C14 H8 As F8 N3 S |
Calculated formula | C14 H8 As F8 N3 S |
SMILES | c1(n[s+]nc(n1)c1ccc(cc1)F)c1ccc(cc1)F.[F-][As](F)(F)(F)(F)F |
Title of publication | Trithiatetrazocine Cations, [RCN4S3]+; Planar Sulfur-Nitrogen 10π Aromatics |
Authors of publication | Carsten Knapp; Paul G. Watson; Enno Lork; Daniel H. Friese; Rüdiger Mews; Andreas Decken |
Journal of publication | Inorganic Chemistry |
Year of publication | 2008 |
Journal volume | 47 |
Pages of publication | 10618 - 10625 |
a | 14.493 ± 0.003 Å |
b | 16.342 ± 0.003 Å |
c | 7.903 ± 0.002 Å |
α | 90° |
β | 116.34 ± 0.02° |
γ | 90° |
Cell volume | 1677.4 ± 0.7 Å3 |
Cell temperature | 163 ± 2 K |
Ambient diffraction temperature | 163 ± 2 K |
Number of distinct elements | 6 |
Space group number | 15 |
Hermann-Mauguin space group symbol | C 1 2/c 1 |
Hall space group symbol | -C 2yc |
Residual factor for all reflections | 0.0586 |
Residual factor for significantly intense reflections | 0.0447 |
Weighted residual factors for significantly intense reflections | 0.1091 |
Weighted residual factors for all reflections included in the refinement | 0.1173 |
Goodness-of-fit parameter for all reflections included in the refinement | 1.037 |
Diffraction radiation wavelength | 0.71073 Å |
Diffraction radiation type | MoKα |