Information card for entry 4306460
Formula | C46 H66 B Lu O5 |
Calculated formula | C46 H66 B Lu O5 |
SMILES | [O]1([Lu]([O]2CCCC2)([O]2CCCC2)([O]2CCCC2)(C)C)CCCC1.O1CCCC1.[B-](c1ccccc1)(c1ccccc1)(c1ccccc1)c1ccccc1 |
Title of publication | Cationic Methyl Complexes of the Rare-Earth Metals: An Experimental and Computational Study on Synthesis, Structure, and Reactivity |
Authors of publication | Mathias U. Kramer; Dominique Robert; Stefan Arndt; Peter M. Zeimentz; Thomas P. Spaniol; Ahmed Yahia; Laurent Maron; Odile Eisenstein; Jun Okuda |
Journal of publication | Inorganic Chemistry |
Year of publication | 2008 |
Journal volume | 47 |
Pages of publication | 9265 - 9278 |
a | 12.695 ± 0.001 Å |
b | 28.004 ± 0.002 Å |
c | 13.013 ± 0.001 Å |
α | 90° |
β | 111.039 ± 0.001° |
γ | 90° |
Cell volume | 4317.9 ± 0.6 Å3 |
Cell temperature | 130 ± 2 K |
Ambient diffraction temperature | 130 ± 2 K |
Number of distinct elements | 5 |
Space group number | 14 |
Hermann-Mauguin space group symbol | P 1 21/c 1 |
Hall space group symbol | -P 2ybc |
Residual factor for all reflections | 0.0613 |
Residual factor for significantly intense reflections | 0.0354 |
Weighted residual factors for significantly intense reflections | 0.0626 |
Weighted residual factors for all reflections included in the refinement | 0.0663 |
Goodness-of-fit parameter for all reflections included in the refinement | 0.872 |
Diffraction radiation wavelength | 0.71073 Å |
Diffraction radiation type | MoKα |