Information card for entry 4306465
Formula | C45 H67 B2 O5 Y |
Calculated formula | C45 H67 B2 O5 Y |
SMILES | [Y]1([O]3CCCC3)([O]3CCCC3)([O]3CCCC3)([O]3CCCC3)([O]3CCCC3)([H][BH2][H]1)C.[B-](c1ccccc1)(c1ccccc1)(c1ccccc1)c1ccccc1 |
Title of publication | Cationic Methyl Complexes of the Rare-Earth Metals: An Experimental and Computational Study on Synthesis, Structure, and Reactivity |
Authors of publication | Mathias U. Kramer; Dominique Robert; Stefan Arndt; Peter M. Zeimentz; Thomas P. Spaniol; Ahmed Yahia; Laurent Maron; Odile Eisenstein; Jun Okuda |
Journal of publication | Inorganic Chemistry |
Year of publication | 2008 |
Journal volume | 47 |
Pages of publication | 9265 - 9278 |
a | 13.5304 ± 0.0016 Å |
b | 13.0945 ± 0.0016 Å |
c | 24.622 ± 0.003 Å |
α | 90° |
β | 90.7 ± 0.002° |
γ | 90° |
Cell volume | 4362 ± 0.9 Å3 |
Cell temperature | 120 ± 2 K |
Ambient diffraction temperature | 120 ± 2 K |
Number of distinct elements | 5 |
Space group number | 14 |
Hermann-Mauguin space group symbol | P 1 21/c 1 |
Hall space group symbol | -P 2ybc |
Residual factor for all reflections | 0.125 |
Residual factor for significantly intense reflections | 0.0838 |
Weighted residual factors for significantly intense reflections | 0.2281 |
Weighted residual factors for all reflections included in the refinement | 0.2495 |
Goodness-of-fit parameter for all reflections included in the refinement | 1.089 |
Diffraction radiation wavelength | 0.71073 Å |
Diffraction radiation type | MoKα |