Information card for entry 4306477
Formula | B10 Br H13 |
Calculated formula | B10 Br H13 |
SMILES | Br[B]1234[BH]567[BH]89%10[BH]%11%125[BH]5%138[BH]8%12([BH]27%11[H]4)[BH]25([BH]%10%13([BH]169[H]3)[H]2)[H]8 |
Title of publication | Crystallographic Characterizations and New High-Yield Synthetic Routes for the Complete Series of 6-X-B10H13 Halodecaboranes (X = F, Cl, Br, I) via Superacid-Induced Cage-Opening Reactions ofcloso-B10H102- |
Authors of publication | William C. Ewing; Patrick J. Carroll; Larry G. Sneddon |
Journal of publication | Inorganic Chemistry |
Year of publication | 2008 |
Journal volume | 47 |
Pages of publication | 8580 - 8582 |
a | 12.391 ± 0.002 Å |
b | 7.7367 ± 0.0009 Å |
c | 11.203 ± 0.002 Å |
α | 90° |
β | 114.947 ± 0.003° |
γ | 90° |
Cell volume | 973.8 ± 0.3 Å3 |
Cell temperature | 143 ± 1 K |
Ambient diffraction temperature | 143 ± 1 K |
Number of distinct elements | 3 |
Space group number | 14 |
Hermann-Mauguin space group symbol | P 1 21/c 1 |
Hall space group symbol | -P 2ybc |
Residual factor for all reflections | 0.0494 |
Residual factor for significantly intense reflections | 0.037 |
Weighted residual factors for significantly intense reflections | 0.0989 |
Weighted residual factors for all reflections included in the refinement | 0.1483 |
Goodness-of-fit parameter for all reflections included in the refinement | 1.117 |
Diffraction radiation wavelength | 0.71073 Å |
Diffraction radiation type | MoKα |