Information card for entry 4306488
Formula | C37 H68 Cl2 Ga I3 P2 Pt |
Calculated formula | C37 H68 Cl2 Ga I3 P2 Pt |
SMILES | I[Pt]([Ga](I)I)([P](C1CCCCC1)(C1CCCCC1)C1CCCCC1)[P](C1CCCCC1)(C1CCCCC1)C1CCCCC1.C(Cl)Cl |
Title of publication | Reactivity of Pt0 Complexes toward Gallium(III) Halides: Synthesis of a Platinum Gallane Complex and Oxidative Addition of Gallium Halides to Pt0 |
Authors of publication | Holger Braunschweig; Katrin Gruss; Krzysztof Radacki |
Journal of publication | Inorganic Chemistry |
Year of publication | 2008 |
Journal volume | 47 |
Pages of publication | 8595 - 8597 |
a | 31.941 ± 0.006 Å |
b | 10.668 ± 0.002 Å |
c | 13.181 ± 0.003 Å |
α | 90° |
β | 90° |
γ | 90° |
Cell volume | 4491.4 ± 1.6 Å3 |
Cell temperature | 173 ± 2 K |
Ambient diffraction temperature | 171 ± 2 K |
Number of distinct elements | 7 |
Space group number | 33 |
Hermann-Mauguin space group symbol | P n a 21 |
Hall space group symbol | P 2c -2n |
Residual factor for all reflections | 0.0236 |
Residual factor for significantly intense reflections | 0.0229 |
Weighted residual factors for significantly intense reflections | 0.0538 |
Weighted residual factors for all reflections included in the refinement | 0.0541 |
Goodness-of-fit parameter for all reflections included in the refinement | 1.124 |
Diffraction radiation wavelength | 0.71073 Å |
Diffraction radiation type | MoKα |