Information card for entry 4306500
Chemical name | hexa(hexafluoroacetylacetonate)-trinickel(II,II,II) |
Formula | C30 H6 F36 Ni3 O12 |
Calculated formula | C30 H6 F36 Ni3 O12 |
Title of publication | Fluorinated β-Diketonates of the First Row Divalent Transition Metals: New Approach to the Synthesis of Unsolvated Species |
Authors of publication | Haitao Zhang; Bo Li; Jinyu Sun; Rodolphe Clérac; Evgeny V. Dikarev |
Journal of publication | Inorganic Chemistry |
Year of publication | 2008 |
Journal volume | 47 |
Pages of publication | 10046 - 10052 |
a | 17.518 ± 0.002 Å |
b | 16.237 ± 0.002 Å |
c | 16.842 ± 0.002 Å |
α | 90° |
β | 114.619 ± 0.002° |
γ | 90° |
Cell volume | 4355.1 ± 0.9 Å3 |
Cell temperature | 90 ± 2 K |
Ambient diffraction temperature | 90 ± 2 K |
Number of distinct elements | 5 |
Space group number | 14 |
Hermann-Mauguin space group symbol | P 1 21/c 1 |
Hall space group symbol | -P 2ybc |
Residual factor for all reflections | 0.0441 |
Residual factor for significantly intense reflections | 0.0358 |
Weighted residual factors for significantly intense reflections | 0.0898 |
Weighted residual factors for all reflections included in the refinement | 0.0964 |
Goodness-of-fit parameter for all reflections included in the refinement | 1.029 |
Diffraction radiation wavelength | 0.71073 Å |
Diffraction radiation type | MoKα |