Information card for entry 4306522
Common name | [Ni(cyclam)][Cu(tfadt)2] |
Formula | C18 H24 Cu F6 N6 Ni S4 |
Calculated formula | C18 H24 Cu F6 N6 Ni S4 |
Title of publication | Ferromagnetic Interactions in Heterobimetallic Chains Formed through the Secondary Coordination of Dithiolene Complexes |
Authors of publication | Olivier Jeannin; Rodolphe Clérac; Thomas Cauchy; Marc Fourmigué |
Journal of publication | Inorganic Chemistry |
Year of publication | 2008 |
Journal volume | 47 |
Pages of publication | 10656 - 10661 |
a | 10.5773 ± 0.0012 Å |
b | 10.8899 ± 0.0011 Å |
c | 11.4306 ± 0.0009 Å |
α | 90° |
β | 97.292 ± 0.008° |
γ | 90° |
Cell volume | 1306 ± 0.2 Å3 |
Cell temperature | 293 ± 2 K |
Ambient diffraction temperature | 293 ± 2 K |
Number of distinct elements | 7 |
Space group number | 14 |
Hermann-Mauguin space group symbol | P 1 21/n 1 |
Hall space group symbol | -P 2yn |
Residual factor for all reflections | 0.0823 |
Residual factor for significantly intense reflections | 0.0416 |
Weighted residual factors for significantly intense reflections | 0.1088 |
Weighted residual factors for all reflections included in the refinement | 0.1288 |
Goodness-of-fit parameter for all reflections included in the refinement | 1.09 |
Diffraction radiation wavelength | 0.71073 Å |
Diffraction radiation type | MoKα |