Information card for entry 4306533
Formula | C13.5 H B Br8 Cl F2 N2 S |
Calculated formula | C13.5 H B Br8 Cl F2 N2 S |
Title of publication | Optical Effects of S-Oxidation and Mn+ Binding in meso-Thienyl Dipyrrin Systems and of Stepwise Bromination of 4,4-Difluoro-8-(2,5-dibromo-3-thienyl)-4-bora-3a,4a-diaza-s-indacene |
Authors of publication | Shin Hei Choi; Kibong Kim; June Jeon; Bhupal Meka; Daniela Bucella; Keliang Pang; Snehadrinarayan Khatua; Junseong Lee; David G. Churchill |
Journal of publication | Inorganic Chemistry |
Year of publication | 2008 |
Journal volume | 47 |
Pages of publication | 11071 - 11083 |
a | 8.844 ± 0.005 Å |
b | 11.556 ± 0.007 Å |
c | 12.998 ± 0.011 Å |
α | 111.075 ± 0.014° |
β | 99.542 ± 0.014° |
γ | 104.441 ± 0.01° |
Cell volume | 1151.4 ± 1.4 Å3 |
Cell temperature | 296 ± 2 K |
Ambient diffraction temperature | 296 ± 2 K |
Number of distinct elements | 8 |
Space group number | 2 |
Hermann-Mauguin space group symbol | P -1 |
Hall space group symbol | -P 1 |
Residual factor for all reflections | 0.262 |
Residual factor for significantly intense reflections | 0.0921 |
Weighted residual factors for significantly intense reflections | 0.1917 |
Weighted residual factors for all reflections included in the refinement | 0.2389 |
Goodness-of-fit parameter for all reflections included in the refinement | 1.046 |
Diffraction radiation wavelength | 0.71073 Å |
Diffraction radiation type | MoKα |