Information card for entry 4306538
Formula | C39 H27 Co N6 S3 |
Calculated formula | C39 H27 Co N6 S3 |
SMILES | [Co]123(n4cccc4C(=c4[n]1ccc4)c1sccc1)(n1cccc1C(=c1[n]2ccc1)c1sccc1)n1cccc1C(=c1[n]3ccc1)c1sccc1 |
Title of publication | Optical Effects of S-Oxidation and Mn+ Binding in meso-Thienyl Dipyrrin Systems and of Stepwise Bromination of 4,4-Difluoro-8-(2,5-dibromo-3-thienyl)-4-bora-3a,4a-diaza-s-indacene |
Authors of publication | Shin Hei Choi; Kibong Kim; June Jeon; Bhupal Meka; Daniela Bucella; Keliang Pang; Snehadrinarayan Khatua; Junseong Lee; David G. Churchill |
Journal of publication | Inorganic Chemistry |
Year of publication | 2008 |
Journal volume | 47 |
Pages of publication | 11071 - 11083 |
a | 14.6499 ± 0.0006 Å |
b | 14.3707 ± 0.0006 Å |
c | 16.9666 ± 0.0007 Å |
α | 90° |
β | 113.713 ± 0.001° |
γ | 90° |
Cell volume | 3270.4 ± 0.2 Å3 |
Cell temperature | 273 ± 2 K |
Ambient diffraction temperature | 273 ± 2 K |
Number of distinct elements | 5 |
Space group number | 14 |
Hermann-Mauguin space group symbol | P 1 21/c 1 |
Hall space group symbol | -P 2ybc |
Residual factor for all reflections | 0.0909 |
Residual factor for significantly intense reflections | 0.0613 |
Weighted residual factors for significantly intense reflections | 0.1827 |
Weighted residual factors for all reflections included in the refinement | 0.2063 |
Goodness-of-fit parameter for all reflections included in the refinement | 1.028 |
Diffraction radiation wavelength | 0.71073 Å |
Diffraction radiation type | MoKα |