Information card for entry 4306543
Formula | C32 H34 F6 N7 O4 P Ru |
Calculated formula | C32 H34 F6 N7 O4 P Ru |
SMILES | [Ru]123456([n]7cccc([O-])c7c7[n]1cccc7O)([n]1cn(c7nc([nH]c(=O)c17)N)CC)[cH]1[cH]2[cH]3[cH]4[c]25CC3=C(CC=CC3)C[c]612.OC.[P](F)(F)(F)(F)(F)[F-] |
Title of publication | The Contrasting Chemistry and Cancer Cell Cytotoxicity of Bipyridine and Bipyridinediol Ruthenium(II) Arene Complexes |
Authors of publication | Tijana Bugarcic; Abraha Habtemariam; Jana Stepankova; Pavla Heringova; Jana Kasparkova; Robert J. Deeth; Russell D. L. Johnstone; Alessandro Prescimone; Andrew Parkin; Simon Parsons; Viktor Brabec; Peter J. Sadler |
Journal of publication | Inorganic Chemistry |
Year of publication | 2008 |
Journal volume | 47 |
Pages of publication | 11470 - 11486 |
a | 9.5526 ± 0.0002 Å |
b | 10.863 ± 0.0002 Å |
c | 31.624 ± 0.0007 Å |
α | 90° |
β | 95.174 ± 0.001° |
γ | 90° |
Cell volume | 3268.25 ± 0.12 Å3 |
Cell temperature | 150 K |
Ambient diffraction temperature | 150 K |
Number of distinct elements | 7 |
Space group number | 14 |
Hermann-Mauguin space group symbol | P 1 21/n 1 |
Hall space group symbol | -P 2yn |
Residual factor for all reflections | 0.0658 |
Residual factor for significantly intense reflections | 0.0408 |
Weighted residual factors for all reflections | 0.0457 |
Weighted residual factors for significantly intense reflections | 0.0427 |
Weighted residual factors for all reflections included in the refinement | 0.0427 |
Goodness-of-fit parameter for all reflections included in the refinement | 1.0967 |
Diffraction radiation wavelength | 0.71073 Å |
Diffraction radiation type | MoKα |