Information card for entry 4306554
Formula | C6 H4 Cl7 Ga2 N S Te |
Calculated formula | C6 H4 Cl7 Ga2 N S Te |
SMILES | [Te]1N([Ga](Cl)(Cl)Cl)c2ccccc2S1.[Ga](Cl)(Cl)(Cl)[Cl-] |
Title of publication | Heavy Atom Analogues of 1,2,3-Dithiazolylium Salts: Preparation, Structures and Redox Chemistry |
Authors of publication | Maarit Risto; Abdeljalil Assoud; Stephen M. Winter; Raija Oilunkaniemi; Risto S. Laitinen; Richard T. Oakley |
Journal of publication | Inorganic Chemistry |
Year of publication | 2008 |
Journal volume | 47 |
Pages of publication | 10100 - 10109 |
a | 9.7208 ± 0.0003 Å |
b | 18.2525 ± 0.0005 Å |
c | 9.9986 ± 0.0003 Å |
α | 90° |
β | 99.013 ± 0.001° |
γ | 90° |
Cell volume | 1752.14 ± 0.09 Å3 |
Cell temperature | 200 ± 2 K |
Ambient diffraction temperature | 200 ± 2 K |
Number of distinct elements | 7 |
Space group number | 14 |
Hermann-Mauguin space group symbol | P 1 21/n 1 |
Hall space group symbol | -P 2yn |
Residual factor for all reflections | 0.0412 |
Residual factor for significantly intense reflections | 0.0307 |
Weighted residual factors for significantly intense reflections | 0.0591 |
Weighted residual factors for all reflections included in the refinement | 0.0632 |
Goodness-of-fit parameter for all reflections included in the refinement | 1.087 |
Diffraction radiation wavelength | 0.71073 Å |
Diffraction radiation type | MoKα |