Information card for entry 4306558
Formula | C12 H28 I N P2 Se Te |
Calculated formula | C12 H28 I N P2 Se Te |
SMILES | I[Te]1[Se]P(=N[P]1(C(C)C)C(C)C)(C(C)C)C(C)C |
Title of publication | Experimental and Theoretical Investigations of the Redox Behavior of the Heterodichalcogenido Ligands [(EPiPr2)(TePiPr2)N]-(E = S, Se): Cyclic Cations and Acyclic Dichalcogenide Dimers |
Authors of publication | Stuart D. Robertson; Tristram Chivers; Heikki M. Tuononen |
Journal of publication | Inorganic Chemistry |
Year of publication | 2008 |
Journal volume | 47 |
Pages of publication | 10634 - 10643 |
a | 10.3513 ± 0.0002 Å |
b | 15.5319 ± 0.0003 Å |
c | 13.3861 ± 0.0003 Å |
α | 90° |
β | 112.206 ± 0.0013° |
γ | 90° |
Cell volume | 1992.53 ± 0.07 Å3 |
Cell temperature | 173 ± 2 K |
Ambient diffraction temperature | 173 ± 2 K |
Number of distinct elements | 7 |
Space group number | 14 |
Hermann-Mauguin space group symbol | P 1 21/n 1 |
Hall space group symbol | -P 2yn |
Residual factor for all reflections | 0.033 |
Residual factor for significantly intense reflections | 0.0249 |
Weighted residual factors for significantly intense reflections | 0.0569 |
Weighted residual factors for all reflections included in the refinement | 0.0629 |
Goodness-of-fit parameter for all reflections included in the refinement | 1.08 |
Diffraction radiation wavelength | 0.71073 Å |
Diffraction radiation type | MoKα |