Information card for entry 4306562
Formula | C22 H38 Co N P2 Se Te |
Calculated formula | C22 H38 Co N P2 Se Te |
Title of publication | Experimental and Theoretical Investigations of the Redox Behavior of the Heterodichalcogenido Ligands [(EPiPr2)(TePiPr2)N]-(E = S, Se): Cyclic Cations and Acyclic Dichalcogenide Dimers |
Authors of publication | Stuart D. Robertson; Tristram Chivers; Heikki M. Tuononen |
Journal of publication | Inorganic Chemistry |
Year of publication | 2008 |
Journal volume | 47 |
Pages of publication | 10634 - 10643 |
a | 26.156 ± 0.004 Å |
b | 26.156 ± 0.004 Å |
c | 20.058 ± 0.004 Å |
α | 90° |
β | 90° |
γ | 120° |
Cell volume | 11884 ± 3 Å3 |
Cell temperature | 173 ± 2 K |
Ambient diffraction temperature | 173 ± 2 K |
Number of distinct elements | 7 |
Space group number | 167 |
Hermann-Mauguin space group symbol | R -3 c :H |
Hall space group symbol | -R 3 2"c |
Residual factor for all reflections | 0.0295 |
Residual factor for significantly intense reflections | 0.0238 |
Weighted residual factors for significantly intense reflections | 0.0578 |
Weighted residual factors for all reflections included in the refinement | 0.0607 |
Goodness-of-fit parameter for all reflections included in the refinement | 1.055 |
Diffraction radiation wavelength | 0.71073 Å |
Diffraction radiation type | MoKα |