Information card for entry 4306567
Common name | Fe2L7bMeIm8LS |
Formula | C62 H78 Fe2 N20 O8 |
Calculated formula | C62 H78 Fe2 N20 O8 |
SMILES | C1(=C(C=[N]2c3c([N]4=CC(=C(O[Fe]24([n]2ccn(c2)C)([n]2ccn(c2)C)O1)C)C(=O)C)cc1c(c3)[N]2=CC(=C(O[Fe]32([N]1=CC(=C(O3)C)C(=O)C)([n]1ccn(c1)C)[n]1ccn(c1)C)C)C(=O)C)C(=O)C)C.c1cncn1C.c1cncn1C.c1cncn1C.c1cncn1C |
Title of publication | Synthesis and Characterization of a Dinuclear Iron(II) Spin Crossover Complex with Wide Hysteresis |
Authors of publication | Birgit Weber; Eike S. Kaps; Jaroslava Obel; Klaus Achterhold; Fritz G. Parak |
Journal of publication | Inorganic Chemistry |
Year of publication | 2008 |
Journal volume | 47 |
Pages of publication | 10779 - 10787 |
a | 10.054 ± 0.003 Å |
b | 13.352 ± 0.003 Å |
c | 13.825 ± 0.004 Å |
α | 114.54 ± 0.02° |
β | 109.45 ± 0.03° |
γ | 91.78 ± 0.02° |
Cell volume | 1560.6 ± 0.9 Å3 |
Cell temperature | 125 ± 2 K |
Ambient diffraction temperature | 125 ± 2 K |
Number of distinct elements | 5 |
Space group number | 2 |
Hermann-Mauguin space group symbol | P -1 |
Hall space group symbol | -P 1 |
Residual factor for all reflections | 0.0758 |
Residual factor for significantly intense reflections | 0.0517 |
Weighted residual factors for significantly intense reflections | 0.133 |
Weighted residual factors for all reflections included in the refinement | 0.1513 |
Goodness-of-fit parameter for all reflections included in the refinement | 1.095 |
Diffraction radiation wavelength | 0.71073 Å |
Diffraction radiation type | MoKα |