Information card for entry 4306572
Formula | C24 H24 Cl3 N4 O4 Tb |
Calculated formula | C24 H24 Cl3 N4 O4 Tb |
SMILES | [Tb]12(Cl)([OH2])([OH2])([OH2])([n]3cccc4c3c3c(cc4)ccc[n]13)[n]1cccc3c1c1c(cc3)ccc[n]21.[Cl-].[Cl-].O |
Title of publication | Role of Inner- and Outer-Sphere Bonding in the Sensitization of EuIII-Luminescence Deciphered by Combined Analysis of Experimental Electron Density Distribution Function and Photophysical Data |
Authors of publication | Lada N. Puntus; Konstantin A. Lyssenko; Mikhail Yu. Antipin; Jean-Claude G. Bünzli |
Journal of publication | Inorganic Chemistry |
Year of publication | 2008 |
Journal volume | 47 |
Pages of publication | 11095 - 11107 |
a | 10.3057 ± 0.0006 Å |
b | 10.4724 ± 0.0008 Å |
c | 12.5438 ± 0.0009 Å |
α | 97.568 ± 0.003° |
β | 108.542 ± 0.003° |
γ | 93.415 ± 0.002° |
Cell volume | 1264.91 ± 0.15 Å3 |
Cell temperature | 100 ± 2 K |
Ambient diffraction temperature | 100 ± 2 K |
Number of distinct elements | 6 |
Space group number | 2 |
Hermann-Mauguin space group symbol | P -1 |
Hall space group symbol | -P 1 |
Residual factor for all reflections | 0.031 |
Residual factor for significantly intense reflections | 0.0252 |
Weighted residual factors for significantly intense reflections | 0.0525 |
Weighted residual factors for all reflections included in the refinement | 0.0546 |
Goodness-of-fit parameter for all reflections included in the refinement | 0.983 |
Diffraction radiation wavelength | 0.71073 Å |
Diffraction radiation type | MoKα |