Information card for entry 4306579
Chemical name | Yttrium Copper Crotonate, hydrate |
Formula | C40 H64 Cu2 O27 Y2 |
Calculated formula | C40 H50 Cu2 O27 Y2 |
Title of publication | 1-D Polymers with Alternate Cu2 and Ln2 Units (Ln = Gd, Er, Y) and Carboxylate Linkages |
Authors of publication | Rafael Calvo; Raul E. Rapp; Edson Chagas; Rosana P. Sartoris; Ricardo Baggio; María T. Garland; Mireille Perec |
Journal of publication | Inorganic Chemistry |
Year of publication | 2008 |
Journal volume | 47 |
Pages of publication | 10389 - 10397 |
a | 13.953 ± 0.007 Å |
b | 22.121 ± 0.007 Å |
c | 19.9 ± 0.007 Å |
α | 90° |
β | 107.16 ± 0.03° |
γ | 90° |
Cell volume | 5869 ± 4 Å3 |
Cell temperature | 294 ± 2 K |
Ambient diffraction temperature | 294 ± 2 K |
Number of distinct elements | 5 |
Space group number | 14 |
Hermann-Mauguin space group symbol | P 1 21/c 1 |
Hall space group symbol | -P 2ybc |
Residual factor for all reflections | 0.1361 |
Residual factor for significantly intense reflections | 0.0585 |
Weighted residual factors for significantly intense reflections | 0.1463 |
Weighted residual factors for all reflections included in the refinement | 0.1884 |
Goodness-of-fit parameter for all reflections included in the refinement | 0.91 |
Diffraction radiation wavelength | 0.71073 Å |
Diffraction radiation type | MoKα |