Information card for entry 4306581
Formula | C66 H76 N12 O14 P2 V2 |
Calculated formula | C66 H65 N12 O14 P2 V2 |
Title of publication | Vanadium(V) Compounds with the Bis-(hydroxylamino)-1,3,5-triazine Ligand, H2bihyat: Synthetic, Structural, and Physical Studies of [V2VO3(bihyat)2] and of the Enhanced Hydrolytic Stability Species cis-[VVO2(bihyat)]- |
Authors of publication | Vladimiros A. Nikolakis; John T. Tsalavoutis; Marios Stylianou; Evgenios Evgeniou; Tamas Jakusch; Artem Melman; Michael P. Sigalas; Tamas Kiss; Anastasios D. Keramidas; Themistoklis A. Kabanos |
Journal of publication | Inorganic Chemistry |
Year of publication | 2008 |
Journal volume | 47 |
Pages of publication | 11698 - 11710 |
a | 13.1164 ± 0.0016 Å |
b | 16.8622 ± 0.0011 Å |
c | 16.9807 ± 0.0008 Å |
α | 76.311 ± 0.005° |
β | 67.911 ± 0.007° |
γ | 67.791 ± 0.009° |
Cell volume | 3202.2 ± 0.5 Å3 |
Cell temperature | 100 K |
Ambient diffraction temperature | 100 K |
Number of distinct elements | 6 |
Space group number | 2 |
Hermann-Mauguin space group symbol | P -1 |
Hall space group symbol | -P 1 |
Residual factor for all reflections | 0.1048 |
Residual factor for significantly intense reflections | 0.0725 |
Weighted residual factors for significantly intense reflections | 0.2326 |
Weighted residual factors for all reflections included in the refinement | 0.2542 |
Goodness-of-fit parameter for all reflections included in the refinement | 1.145 |
Diffraction radiation wavelength | 0.71073 Å |
Diffraction radiation type | MoKα |