Information card for entry 4306596
Formula | C96 H76 Cu N20 P4 Pt2 |
Calculated formula | C96 H76 Cu N20 P4 Pt2 |
Title of publication | PtII-Promoted [2 + 3] Cycloaddition of Azide to Cyanopyridines: Convenient Tool toward Heterometallic Structures |
Authors of publication | Suman Mukhopadhyay; Bhaswati Ghosh Mukhopadhyay; M. Fátima C. Guedes da Silva; Jamal Lasri; M. Adília Januário Charmier; Armando J. L. Pombeiro |
Journal of publication | Inorganic Chemistry |
Year of publication | 2008 |
Journal volume | 47 |
Pages of publication | 11334 - 11341 |
a | 27 ± 0.0015 Å |
b | 17.1351 ± 0.001 Å |
c | 21.948 ± 0.0013 Å |
α | 90° |
β | 90° |
γ | 90° |
Cell volume | 10154.2 ± 1 Å3 |
Cell temperature | 150 ± 2 K |
Ambient diffraction temperature | 150 ± 2 K |
Number of distinct elements | 6 |
Space group number | 60 |
Hermann-Mauguin space group symbol | P b c n |
Hall space group symbol | -P 2n 2ab |
Residual factor for all reflections | 0.0483 |
Residual factor for significantly intense reflections | 0.0315 |
Weighted residual factors for significantly intense reflections | 0.0732 |
Weighted residual factors for all reflections included in the refinement | 0.0777 |
Goodness-of-fit parameter for all reflections included in the refinement | 1.016 |
Diffraction radiation wavelength | 0.71073 Å |
Diffraction radiation type | MoKα |