Information card for entry 4306610
Common name | Y(^i^PrN)~2~CNMe~2~ (1a) |
Formula | C27 H60 N9 Y |
Calculated formula | C27 H60 N9 Y |
SMILES | C1(=[N](C(C)C)[Y]23([N](C(C)C)=C(N3C(C)C)N(C)C)([N](C(C)C)=C(N2C(C)C)N(C)C)N1C(C)C)N(C)C |
Title of publication | Synthesis, Characterization, and Thermal Properties of Homoleptic Rare-Earth Guanidinates: Promising Precursors for MOCVD and ALD of Rare-Earth Oxide Thin Films |
Authors of publication | Andrian P. Milanov; Roland A. Fischer; Anjana Devi |
Journal of publication | Inorganic Chemistry |
Year of publication | 2008 |
Journal volume | 47 |
Pages of publication | 11405 - 11416 |
a | 10.7165 ± 0.0005 Å |
b | 11.1694 ± 0.0006 Å |
c | 16.1278 ± 0.0006 Å |
α | 91.657 ± 0.004° |
β | 95.859 ± 0.004° |
γ | 115.249 ± 0.005° |
Cell volume | 1731.25 ± 0.16 Å3 |
Cell temperature | 113 ± 2 K |
Ambient diffraction temperature | 113 ± 2 K |
Number of distinct elements | 4 |
Space group number | 2 |
Hermann-Mauguin space group symbol | P -1 |
Hall space group symbol | -P 1 |
Residual factor for all reflections | 0.0649 |
Residual factor for significantly intense reflections | 0.0385 |
Weighted residual factors for significantly intense reflections | 0.0697 |
Weighted residual factors for all reflections included in the refinement | 0.0726 |
Goodness-of-fit parameter for all reflections included in the refinement | 0.814 |
Diffraction radiation wavelength | 0.71073 Å |
Diffraction radiation type | MoKα |