Information card for entry 4306615
Common name | Dy(^i^PrN)~2~CNEt~2~ (2c) |
Formula | C39 H82 Dy N9 |
Calculated formula | C39 H82 Dy N9 |
SMILES | C1(=[N]([Dy]23([N](=C(N2C(C)C)N(CC)CC)C(C)C)([N](=C(N3C(C)C)N(CC)CC)C(C)C)N1C(C)C)C(C)C)N(CC)CC.C1CCCCC1 |
Title of publication | Synthesis, Characterization, and Thermal Properties of Homoleptic Rare-Earth Guanidinates: Promising Precursors for MOCVD and ALD of Rare-Earth Oxide Thin Films |
Authors of publication | Andrian P. Milanov; Roland A. Fischer; Anjana Devi |
Journal of publication | Inorganic Chemistry |
Year of publication | 2008 |
Journal volume | 47 |
Pages of publication | 11405 - 11416 |
a | 22.1555 ± 0.0012 Å |
b | 13.1098 ± 0.0004 Å |
c | 17.351 ± 0.0007 Å |
α | 90° |
β | 114.215 ± 0.005° |
γ | 90° |
Cell volume | 4596.2 ± 0.4 Å3 |
Cell temperature | 113 ± 2 K |
Ambient diffraction temperature | 113 ± 2 K |
Number of distinct elements | 4 |
Space group number | 15 |
Hermann-Mauguin space group symbol | C 1 2/c 1 |
Hall space group symbol | -C 2yc |
Residual factor for all reflections | 0.0764 |
Residual factor for significantly intense reflections | 0.0562 |
Weighted residual factors for significantly intense reflections | 0.1494 |
Weighted residual factors for all reflections included in the refinement | 0.1673 |
Goodness-of-fit parameter for all reflections included in the refinement | 1.012 |
Diffraction radiation wavelength | 0.71073 Å |
Diffraction radiation type | MoKα |