Information card for entry 4306621
Common name | Me3NNNi(I)lut |
Formula | C34 H48 I N3 Ni O |
Calculated formula | C34 H48 I N3 Ni O |
SMILES | I[Ni]1(N(C(=CC(=[N]1c1c(cc(cc1C)C)C)C)C)c1c(cc(cc1C)C)C)[n]1ccc(cc1C)C.O(CC)CC |
Title of publication | Reductive Cleavage of O-, S-, and N-Organonitroso Compounds by Nickel(I) β-Diketiminates |
Authors of publication | Marie M. Melzer; Sarah Jarchow-Choy; Elzbieta Kogut; Timothy H. Warren |
Journal of publication | Inorganic Chemistry |
Year of publication | 2008 |
Journal volume | 47 |
Pages of publication | 10187 - 10189 |
a | 15.691 ± 0.004 Å |
b | 8.4554 ± 0.0019 Å |
c | 26.077 ± 0.006 Å |
α | 90° |
β | 100.823 ± 0.004° |
γ | 90° |
Cell volume | 3398.2 ± 1.4 Å3 |
Cell temperature | 173 ± 2 K |
Ambient diffraction temperature | 173 ± 2 K |
Number of distinct elements | 6 |
Space group number | 14 |
Hermann-Mauguin space group symbol | P 1 21/n 1 |
Hall space group symbol | -P 2yn |
Residual factor for all reflections | 0.0662 |
Residual factor for significantly intense reflections | 0.0431 |
Weighted residual factors for significantly intense reflections | 0.0985 |
Weighted residual factors for all reflections included in the refinement | 0.1036 |
Goodness-of-fit parameter for all reflections included in the refinement | 1.076 |
Diffraction radiation wavelength | 0.71073 Å |
Diffraction radiation type | MoKα |