Information card for entry 4306668
Formula | C21 H69 Cd3 Cl10 Co3 Cu N15 O13 S3 |
Calculated formula | C21 H63 Cd3 Cl10 Co3 Cu N15 O13 S3 |
Title of publication | Control of 1D Wave versus 2D Honeycomb CoIIICdIICuI Heterotrimetallic Architectures by ΔL-ΛL Diastereoisomerism of l-Cysteinatocobalt(III) Building Units |
Authors of publication | Takashi Aridomi; Asako Igashira-Kamiyama; Takumi Konno |
Journal of publication | Inorganic Chemistry |
Year of publication | 2008 |
Journal volume | 47 |
Pages of publication | 10202 - 10204 |
a | 13.9575 ± 0.0014 Å |
b | 13.9575 ± 0.0014 Å |
c | 16.1626 ± 0.0018 Å |
α | 90° |
β | 90° |
γ | 120° |
Cell volume | 2726.8 ± 0.5 Å3 |
Cell temperature | 296 ± 2 K |
Ambient diffraction temperature | 296 ± 2 K |
Number of distinct elements | 9 |
Space group number | 173 |
Hermann-Mauguin space group symbol | P 63 |
Hall space group symbol | P 6c |
Residual factor for all reflections | 0.0972 |
Residual factor for significantly intense reflections | 0.0359 |
Weighted residual factors for significantly intense reflections | 0.0791 |
Weighted residual factors for all reflections included in the refinement | 0.0939 |
Goodness-of-fit parameter for all reflections included in the refinement | 1.014 |
Diffraction radiation wavelength | 0.71069 Å |
Diffraction radiation type | MoKα |