Information card for entry 4306679
Formula | C16 H19 Co2.5 O10 |
Calculated formula | C16 H19 Co2.5 O10 |
Title of publication | Probing Single-Chain Magnets in a Family of Linear Chain Compounds Constructed by Magnetically Anisotropic Metal-Ions and Cyclohexane-1,2-Dicarboxylate Analogues |
Authors of publication | Yan-Zhen Zheng; Wei Xue; Ming-Liang Tong; Xiao-Ming Chen; Shao-Liang Zheng |
Journal of publication | Inorganic Chemistry |
Year of publication | 2008 |
Journal volume | 47 |
Pages of publication | 11202 - 11211 |
a | 7.2231 ± 0.0004 Å |
b | 9.1683 ± 0.0006 Å |
c | 14.5105 ± 0.0009 Å |
α | 74.563 ± 0.001° |
β | 78.838 ± 0.001° |
γ | 82.749 ± 0.001° |
Cell volume | 905.91 ± 0.1 Å3 |
Cell temperature | 293 ± 2 K |
Ambient diffraction temperature | 293 ± 2 K |
Number of distinct elements | 4 |
Space group number | 2 |
Hermann-Mauguin space group symbol | P -1 |
Hall space group symbol | -P 1 |
Residual factor for all reflections | 0.0374 |
Residual factor for significantly intense reflections | 0.0344 |
Weighted residual factors for significantly intense reflections | 0.0937 |
Weighted residual factors for all reflections included in the refinement | 0.0959 |
Goodness-of-fit parameter for all reflections included in the refinement | 1.026 |
Diffraction radiation wavelength | 0.71073 Å |
Diffraction radiation type | MoKα |