Information card for entry 4306707
Chemical name | N-(dichloromethylsilyl)-N-[bis-(2,4,6-trimethylphenyl)phenyl]amino- dimethylarsane toluene solvate |
Formula | C34 H42 As Cl2 N Si |
Calculated formula | C34 H42 As Cl2 N Si |
Title of publication | Lewis-Acid-Assisted Methyl Exchange Reactions In Silylated Aminodichloroarsanes |
Authors of publication | Dirk Michalik; Axel Schulz; Alexander Villinger |
Journal of publication | Inorganic Chemistry |
Year of publication | 2008 |
Journal volume | 47 |
Pages of publication | 11798 - 11806 |
a | 12.813 ± 0.003 Å |
b | 12.597 ± 0.003 Å |
c | 20.432 ± 0.004 Å |
α | 90° |
β | 98.8 ± 0.03° |
γ | 90° |
Cell volume | 3259 ± 1.3 Å3 |
Cell temperature | 173 ± 2 K |
Ambient diffraction temperature | 173 ± 2 K |
Number of distinct elements | 6 |
Space group number | 14 |
Hermann-Mauguin space group symbol | P 1 21/c 1 |
Hall space group symbol | -P 2ybc |
Residual factor for all reflections | 0.0514 |
Residual factor for significantly intense reflections | 0.033 |
Weighted residual factors for significantly intense reflections | 0.0794 |
Weighted residual factors for all reflections included in the refinement | 0.0841 |
Goodness-of-fit parameter for all reflections included in the refinement | 1.032 |
Diffraction radiation wavelength | 0.71073 Å |
Diffraction radiation type | MoKα |