Information card for entry 4306715
Common name | (Et4N)3[Fe4S4Cl4].Et4N(HS) |
Chemical name | tetrakis(Tetraethylammonium) tetrakis((μ~3~-sulfido)-chloro-iron) hydrosulfide |
Formula | C32 H80 Cl5 Fe4 N4 S4 |
Calculated formula | C32 H80 Cl5 Fe4 N4 S4 |
SMILES | C(C)[N+](CC)(CC)CC.[S]12[Fe]3456(Cl)[S]7[Fe]8914([S]1[Fe]4578([S]3[Fe]26914Cl)Cl)Cl.[Cl-].C(C)[N+](CC)(CC)CC.C(C)[N+](CC)(CC)CC.C(C)[N+](CC)(CC)CC |
Title of publication | A Continuous Symmetry Measure of [4Fe-4S]+ Core Distortions and Analysis of Supramolecular Synthons in Crystal Structures of (Et4N)3[Fe4S4Cl4].Et4NCl at 100 and 295 K |
Authors of publication | Karl S. Hagen; Mohammad Uddin |
Journal of publication | Inorganic Chemistry |
Year of publication | 2008 |
Journal volume | 47 |
Pages of publication | 11807 - 11815 |
a | 12.4354 ± 0.0013 Å |
b | 12.4354 ± 0.0013 Å |
c | 16.385 ± 0.003 Å |
α | 90° |
β | 90° |
γ | 90° |
Cell volume | 2533.8 ± 0.6 Å3 |
Cell temperature | 298 ± 2 K |
Ambient diffraction temperature | 298 ± 2 K |
Number of distinct elements | 6 |
Space group number | 114 |
Hermann-Mauguin space group symbol | P -4 21 c |
Hall space group symbol | P -4 2n |
Residual factor for all reflections | 0.0363 |
Residual factor for significantly intense reflections | 0.0335 |
Weighted residual factors for significantly intense reflections | 0.0708 |
Weighted residual factors for all reflections included in the refinement | 0.0719 |
Goodness-of-fit parameter for all reflections included in the refinement | 1.037 |
Diffraction radiation probe | x-ray |
Diffraction radiation wavelength | 0.71073 Å |
Diffraction radiation type | MoKα |