Information card for entry 4306732
Formula | C52 H46 Mn N O P2 S4 |
Calculated formula | C52 H46 Mn N O P2 S4 |
SMILES | [Mn]12(Sc3ccccc3S1)(Sc1ccccc1S2)[O]1CCCC1.[P](=N[P+](c1ccccc1)(c1ccccc1)c1ccccc1)(c1ccccc1)(c1ccccc1)c1ccccc1 |
Title of publication | Monoanionic {Mn(NO)}5 and Dianionic {Mn(NO)}6 Thiolatonitrosylmanganese Complexes: [(NO)Mn(L)2]- and [(NO)Mn(L)2]2- (LH2= 1,2-Benzenedithiol and Toluene-3,4-dithiol) |
Authors of publication | Chia-Huei Lin; Chien-Ge Chen; Ming-Li Tsai; Gene-Hsiang Lee; Wen-Feng Liaw |
Journal of publication | Inorganic Chemistry |
Year of publication | 2008 |
Journal volume | 47 |
Pages of publication | 11435 - 11443 |
a | 15.109 ± 0.003 Å |
b | 18.34 ± 0.003 Å |
c | 17.035 ± 0.004 Å |
α | 90° |
β | 92.17 ± 0.02° |
γ | 90° |
Cell volume | 4717 ± 1.6 Å3 |
Cell temperature | 293 ± 2 K |
Ambient diffraction temperature | 293 ± 2 K |
Number of distinct elements | 7 |
Space group number | 14 |
Hermann-Mauguin space group symbol | P 1 21/c 1 |
Hall space group symbol | -P 2ybc |
Residual factor for all reflections | 0.1077 |
Residual factor for significantly intense reflections | 0.043 |
Weighted residual factors for significantly intense reflections | 0.0921 |
Weighted residual factors for all reflections included in the refinement | 0.1062 |
Goodness-of-fit parameter for all reflections included in the refinement | 1.016 |
Diffraction radiation wavelength | 0.71073 Å |
Diffraction radiation type | MoKα |