Information card for entry 4306734
Formula | C84 H68 Mn N2 P4 S4 |
Calculated formula | C84 H68 Mn N2 P4 S4 |
SMILES | c12ccccc2S[Mn]2(S1)Sc1c(cccc1)S2.c1(ccccc1)P(=N[P+](c1ccccc1)(c1ccccc1)c1ccccc1)(c1ccccc1)c1ccccc1.c1(ccccc1)P(c1ccccc1)(c1ccccc1)=N[P+](c1ccccc1)(c1ccccc1)c1ccccc1 |
Title of publication | Monoanionic {Mn(NO)}5 and Dianionic {Mn(NO)}6 Thiolatonitrosylmanganese Complexes: [(NO)Mn(L)2]- and [(NO)Mn(L)2]2- (LH2= 1,2-Benzenedithiol and Toluene-3,4-dithiol) |
Authors of publication | Chia-Huei Lin; Chien-Ge Chen; Ming-Li Tsai; Gene-Hsiang Lee; Wen-Feng Liaw |
Journal of publication | Inorganic Chemistry |
Year of publication | 2008 |
Journal volume | 47 |
Pages of publication | 11435 - 11443 |
a | 14.9431 ± 0.0003 Å |
b | 27.2374 ± 0.0006 Å |
c | 34.754 ± 0.0008 Å |
α | 90° |
β | 90° |
γ | 90° |
Cell volume | 14145.3 ± 0.5 Å3 |
Cell temperature | 150 ± 2 K |
Ambient diffraction temperature | 150 ± 2 K |
Number of distinct elements | 6 |
Space group number | 70 |
Hermann-Mauguin space group symbol | F d d d :2 |
Hall space group symbol | -F 2uv 2vw |
Residual factor for all reflections | 0.0548 |
Residual factor for significantly intense reflections | 0.0437 |
Weighted residual factors for significantly intense reflections | 0.1035 |
Weighted residual factors for all reflections included in the refinement | 0.1095 |
Goodness-of-fit parameter for all reflections included in the refinement | 1.034 |
Diffraction radiation wavelength | 0.71073 Å |
Diffraction radiation type | MoKα |