Information card for entry 4306788
Common name | (Hob)Ti(OiPr)2 |
Chemical name | (Biphenyl-2'-(4''-p-tolyl-2'',4''-butanedionato)-2-(N-methylacetohydroxamato))- diisopropoxytitanium(IV) |
Formula | C32 H37 N O6 Ti |
Calculated formula | C32 H37 N O6 Ti |
Title of publication | Tetradentate Bis(hydroxamate) and Hydroxamate-Diketonate Ligands and Their Titanium(IV) Complexes |
Authors of publication | Natcharee Kongprakaiwoot; Bruce C. Noll; Seth N. Brown |
Journal of publication | Inorganic Chemistry |
Year of publication | 2008 |
Journal volume | 47 |
Pages of publication | 11902 - 11909 |
a | 11.007 ± 0.0012 Å |
b | 11.816 ± 0.003 Å |
c | 12.4624 ± 0.0012 Å |
α | 74.389 ± 0.013° |
β | 67.345 ± 0.008° |
γ | 80.338 ± 0.015° |
Cell volume | 1436.8 ± 0.4 Å3 |
Cell temperature | 100 ± 2 K |
Ambient diffraction temperature | 100 ± 2 K |
Number of distinct elements | 5 |
Space group number | 2 |
Hermann-Mauguin space group symbol | P -1 |
Hall space group symbol | -P 1 |
Residual factor for all reflections | 0.0476 |
Residual factor for significantly intense reflections | 0.0338 |
Weighted residual factors for significantly intense reflections | 0.0856 |
Weighted residual factors for all reflections included in the refinement | 0.0937 |
Goodness-of-fit parameter for all reflections included in the refinement | 1.032 |
Diffraction radiation wavelength | 0.71073 Å |
Diffraction radiation type | MoKα |