Information card for entry 4306790
Formula | C20 H18 N2 Ni O6 |
Calculated formula | C20 H18 N2 Ni O6 |
SMILES | c12ccccc2[N]2=Cc3c(cc(cc3)O)O[Ni]32[N]1=Cc1c(O3)cc(cc1)O.O.O |
Title of publication | Effects of Metal Coordination Geometry on Stabilization of Human Telomeric Quadruplex DNA by Square-Planar and Square-Pyramidal Metal Complexes |
Authors of publication | Anna Arola-Arnal; Jordi Benet-Buchholz; Stephen Neidle; Ramón Vilar |
Journal of publication | Inorganic Chemistry |
Year of publication | 2008 |
Journal volume | 47 |
Pages of publication | 11910 - 11919 |
a | 10.894 ± 0.0005 Å |
b | 17.652 ± 0.0008 Å |
c | 9.0521 ± 0.0004 Å |
α | 90° |
β | 101.286 ± 0.001° |
γ | 90° |
Cell volume | 1707.07 ± 0.13 Å3 |
Cell temperature | 100 ± 2 K |
Ambient diffraction temperature | 100 ± 2 K |
Number of distinct elements | 5 |
Space group number | 15 |
Hermann-Mauguin space group symbol | C 1 2/c 1 |
Hall space group symbol | -C 2yc |
Residual factor for all reflections | 0.0335 |
Residual factor for significantly intense reflections | 0.0283 |
Weighted residual factors for significantly intense reflections | 0.0802 |
Weighted residual factors for all reflections included in the refinement | 0.0824 |
Goodness-of-fit parameter for all reflections included in the refinement | 1.084 |
Diffraction radiation wavelength | 0.71073 Å |
Diffraction radiation type | MoKα |