Information card for entry 4306816
Formula | C32 H34 Cl F2 N4 O6 Ru2 |
Calculated formula | C32.03 H34.07 Cl F2.01 N4 O6.01 Ru2 |
Title of publication | Electrochemical and Spectroscopic Characterization of a Series of Mixed-Ligand Diruthenium Compounds |
Authors of publication | Karl M. Kadish; Rachel Garcia; Tuan Phan; Julien Wellhoff; Eric Van Caemelbecke; John L. Bear |
Journal of publication | Inorganic Chemistry |
Year of publication | 2008 |
Journal volume | 47 |
Pages of publication | 11423 - 11428 |
a | 19.6666 ± 0.0012 Å |
b | 14.0414 ± 0.0008 Å |
c | 25.4874 ± 0.0015 Å |
α | 90° |
β | 104.186 ± 0.001° |
γ | 90° |
Cell volume | 6823.6 ± 0.7 Å3 |
Cell temperature | 223 ± 2 K |
Ambient diffraction temperature | 223 ± 2 K |
Number of distinct elements | 7 |
Space group number | 15 |
Hermann-Mauguin space group symbol | C 1 2/c 1 |
Hall space group symbol | -C 2yc |
Residual factor for all reflections | 0.0702 |
Residual factor for significantly intense reflections | 0.0384 |
Weighted residual factors for significantly intense reflections | 0.0916 |
Weighted residual factors for all reflections included in the refinement | 0.1117 |
Goodness-of-fit parameter for all reflections included in the refinement | 1.041 |
Diffraction radiation wavelength | 0.71073 Å |
Diffraction radiation type | MoKα |