Information card for entry 4306818
Formula | C44 H57 N2 U |
Calculated formula | C44 H57 N2 U |
SMILES | [U]12345678(N(c9ccccc9)c9ccccc9)(=Nc9c(cccc9C(C)C)C(C)C)([c]9([c]1([c]3([c]2([c]69C)C)C)C)C)[c]1([c]8([c]4([c]5([c]71C)C)C)C)C |
Title of publication | Probing the Chemistry, Electronic Structure and Redox Energetics in Organometallic Pentavalent Uranium Complexes |
Authors of publication | Christopher R. Graves; Anthony E. Vaughn; Eric J. Schelter; Brian L. Scott; Joe D. Thompson; David E. Morris; Jaqueline L. Kiplinger |
Journal of publication | Inorganic Chemistry |
Year of publication | 2008 |
Journal volume | 47 |
Pages of publication | 11879 - 11891 |
a | 13.314 ± 0.004 Å |
b | 16.936 ± 0.005 Å |
c | 32.812 ± 0.009 Å |
α | 90° |
β | 90° |
γ | 90° |
Cell volume | 7399 ± 4 Å3 |
Cell temperature | 141 ± 2 K |
Ambient diffraction temperature | 120 ± 1 K |
Number of distinct elements | 4 |
Space group number | 61 |
Hermann-Mauguin space group symbol | P b c a |
Hall space group symbol | -P 2ac 2ab |
Residual factor for all reflections | 0.0835 |
Residual factor for significantly intense reflections | 0.0503 |
Weighted residual factors for significantly intense reflections | 0.06 |
Weighted residual factors for all reflections included in the refinement | 0.0659 |
Goodness-of-fit parameter for all reflections included in the refinement | 1.106 |
Diffraction radiation wavelength | 0.71073 Å |
Diffraction radiation type | MoKα |