Information card for entry 4306821
Formula | C8 H24 Mn N2 Se10 Sn4 |
Calculated formula | C8 H24 Mn N2 Se10 Sn4 |
Title of publication | Straightforward Route to the Adamantane Clusters [Sn4Q10]4- (Q = S, Se, Te) and Use in the Assembly of Open-Framework Chalcogenides (Me4N)2M[Sn4Se10] (M = MnII, FeII, CoII, ZnII) Including the First Telluride Member (Me4N)2Mn[Ge4Te10] |
Authors of publication | Konstantina Tsamourtzi; Jung-Hwan Song; Thomas Bakas; Arthur J. Freeman; Pantelis N. Trikalitis; Mercouri G. Kanatzidis |
Journal of publication | Inorganic Chemistry |
Year of publication | 2008 |
Journal volume | 47 |
Pages of publication | 11920 - 11929 |
a | 9.9321 ± 0.0013 Å |
b | 9.9321 ± 0.0013 Å |
c | 15.374 ± 0.003 Å |
α | 90° |
β | 90° |
γ | 90° |
Cell volume | 1516.6 ± 0.4 Å3 |
Cell temperature | 297 ± 2 K |
Ambient diffraction temperature | 297 ± 2 K |
Number of distinct elements | 6 |
Space group number | 82 |
Hermann-Mauguin space group symbol | I -4 |
Hall space group symbol | I -4 |
Residual factor for all reflections | 0.0845 |
Residual factor for significantly intense reflections | 0.0535 |
Weighted residual factors for significantly intense reflections | 0.081 |
Weighted residual factors for all reflections included in the refinement | 0.0926 |
Goodness-of-fit parameter for all reflections included in the refinement | 0.987 |
Diffraction radiation wavelength | 0.71073 Å |
Diffraction radiation type | MoKα |