Information card for entry 4306883
Formula | C35 H33 Fe2 N O5 P2 S2 |
Calculated formula | C35 H33 Fe2 N O5 P2 S2 |
SMILES | [Fe]12([Fe]3([S]1CN(C[S]23)CCC)(C#[O])(C#[O])C#[O])([P](CP(c1ccccc1)c1ccccc1)(c1ccccc1)c1ccccc1)(C#[O])C#[O] |
Title of publication | Binuclear Iron-Sulfur Complexes with Bidentate Phosphine Ligands as Active Site Models of Fe-Hydrogenase and Their Catalytic Proton Reduction |
Authors of publication | Weiming Gao; Jesper Ekström; Jianhui Liu; Changneng Chen; Lars Eriksson; Linhong Weng; Björn Åkermark; Licheng Sun |
Journal of publication | Inorganic Chemistry |
Year of publication | 2007 |
Journal volume | 46 |
Pages of publication | 1981 - 1991 |
a | 11.6388 ± 0.0003 Å |
b | 10.639 ± 0.0003 Å |
c | 29.4414 ± 0.0007 Å |
α | 90° |
β | 98.448 ± 0.001° |
γ | 90° |
Cell volume | 3606.03 ± 0.16 Å3 |
Cell temperature | 273 ± 2 K |
Ambient diffraction temperature | 273 ± 2 K |
Number of distinct elements | 7 |
Space group number | 14 |
Hermann-Mauguin space group symbol | P 1 21/c 1 |
Hall space group symbol | -P 2ybc |
Residual factor for all reflections | 0.0687 |
Residual factor for significantly intense reflections | 0.0433 |
Weighted residual factors for significantly intense reflections | 0.1023 |
Weighted residual factors for all reflections included in the refinement | 0.1167 |
Goodness-of-fit parameter for all reflections included in the refinement | 1.009 |
Diffraction radiation wavelength | 0.71073 Å |
Diffraction radiation type | MoKα |