Information card for entry 4306907
Formula | C62.25 H92.5 Au Cl4.5 N S4 |
Calculated formula | C62.25 H92.5 Au Cl4.5 N S4 |
Title of publication | Molecular and Electronic Structure of Square-Planar Gold Complexes Containing Two 1,2-Di(4-tert-butylphenyl)ethylene-1,2-dithiolato Ligands: [Au(2L)2]1+/0/1-/2-. A Combined Experimental and Computational Study |
Authors of publication | Swarnalatha Kokatam; Kallol Ray; Joseph Pap; Eckhard Bill; William E. Geiger; Robert J. LeSuer; Philip H. Rieger; Thomas Weyhermüller; Frank Neese; Karl Wieghardt |
Journal of publication | Inorganic Chemistry |
Year of publication | 2007 |
Journal volume | 46 |
Pages of publication | 1100 - 1111 |
a | 17.727 ± 0.0004 Å |
b | 17.8283 ± 0.0004 Å |
c | 24.6899 ± 0.0006 Å |
α | 69.394 ± 0.005° |
β | 89.774 ± 0.005° |
γ | 65.875 ± 0.005° |
Cell volume | 6575.9 ± 0.5 Å3 |
Cell temperature | 100 ± 2 K |
Ambient diffraction temperature | 100 ± 2 K |
Number of distinct elements | 6 |
Space group number | 2 |
Hermann-Mauguin space group symbol | P -1 |
Hall space group symbol | -P 1 |
Residual factor for all reflections | 0.0426 |
Residual factor for significantly intense reflections | 0.0338 |
Weighted residual factors for significantly intense reflections | 0.0784 |
Weighted residual factors for all reflections included in the refinement | 0.083 |
Goodness-of-fit parameter for all reflections included in the refinement | 1.033 |
Diffraction radiation wavelength | 0.71073 Å |
Diffraction radiation type | MoKα |