Information card for entry 4307051
Formula | C14 H49.4 Br K O52.7 Pr2 S14 W6 |
Calculated formula | C14 Br K O52.7 Pr2 S14 W6 |
Title of publication | Triangular Oxalate Clusters [W3(μ3-S)(μ2-S2)3(C2O4)3]2- as Building Blocks for Coordination Polymers and Nanosized Complexes |
Authors of publication | Maxim N. Sokolov; Artem L. Gushchin; Konstantin A. Kovalenko; Eugenia V. Peresypkina; Alexander V. Virovets; Joaquin Sanchiz; Vladimir P. Fedin |
Journal of publication | Inorganic Chemistry |
Year of publication | 2007 |
Journal volume | 46 |
Pages of publication | 2115 - 2123 |
a | 22.0999 ± 0.0006 Å |
b | 18.6732 ± 0.0005 Å |
c | 16.4904 ± 0.0006 Å |
α | 90° |
β | 100.746 ± 0.001° |
γ | 90° |
Cell volume | 6685.9 ± 0.4 Å3 |
Cell temperature | 90 ± 0.5 K |
Ambient diffraction temperature | 90 ± 0.5 K |
Number of distinct elements | 8 |
Space group number | 15 |
Hermann-Mauguin space group symbol | C 1 2/c 1 |
Hall space group symbol | -C 2yc |
Residual factor for all reflections | 0.0745 |
Residual factor for significantly intense reflections | 0.0416 |
Weighted residual factors for significantly intense reflections | 0.0876 |
Weighted residual factors for all reflections included in the refinement | 0.1003 |
Goodness-of-fit parameter for all reflections included in the refinement | 1.024 |
Diffraction radiation wavelength | 0.71073 Å |
Diffraction radiation type | MoKα |