Information card for entry 4307236
Formula | C13 H8 Cl4 Fe O S10 |
Calculated formula | C13 H8 Cl4 Fe O S10 |
SMILES | [Fe](Cl)(Cl)(Cl)[Cl-].S1CCSC2=C1SC(S2)=C1SC(C(=O)S1)=C1SC2=C(S1)SCCS2 |
Title of publication | Antiferromagnetic or Canted Antiferromagnetic Orderings of Fe(III) d Spins of FeX4- Ions in BEDT-TTFVO(S).FeX4 (X = Cl, Br) [BEDT-TTFVO(S) = Bis(ethylenedithio)tetrathiafulvalenoquinone(-thioquinone)-1,3-dithiolemethide] |
Authors of publication | Mingxing Wang; Xunwen Xiao; Hideki Fujiwara; Toyonari Sugimoto; Satoru Noguchi; Takekazu Ishida; Takehiko Mori; Hiroko Aruga Katori |
Journal of publication | Inorganic Chemistry |
Year of publication | 2007 |
Journal volume | 46 |
Pages of publication | 3049 - 3056 |
a | 6.298 ± 0.002 Å |
b | 21.508 ± 0.008 Å |
c | 17.948 ± 0.007 Å |
α | 90° |
β | 99.075 ± 0.002° |
γ | 90° |
Cell volume | 2400.8 ± 1.5 Å3 |
Cell temperature | 293 K |
Number of distinct elements | 6 |
Space group number | 14 |
Hermann-Mauguin space group symbol | P 1 21/c 1 |
Hall space group symbol | -P 2ybc |
Residual factor for significantly intense reflections | 0.038 |
Weighted residual factors for all reflections included in the refinement | 0.038 |
Goodness-of-fit parameter for all reflections included in the refinement | 1.024 |
Diffraction radiation wavelength | 0.7107 Å |
Diffraction radiation type | MoKα |